Humord
type: ConceptScheme

(kultur etter type)
type: ThesaurusArray
type: Collection
narrower: Æreskultur
preferred label: (culture by type) @en

Æreskultur
type: Innholdsbeskrivende emne
type: Concept
created: 2025-10-29T00:00:00
modified: 2025-10-29T14:54:02
alternative label: Culture of honor @en
broader: (kultur etter type)
definition: Æreskultur er kultur hvor opprettholdelse og krenkelse av en gruppes ære er styrende for handlemåte. <naob.no>
editorial note: Lukket bemerkning: nord25
in scheme: Humord
preferred label: Culture of honour @en

Innholdsbeskrivende emne
type: Class
label: Topic @en