Humord
type: ConceptScheme

(kunst etter funksjon, kontekst, opphav)
type: ThesaurusArray
type: Collection
narrower: Jødisk kunst
preferred label: (art by function, context, origin) @en

Jødisk kunst
type: Innholdsbeskrivende emne
type: Concept
ccmapper candidates: 1
ccmapper state: accepted
created: 2025-10-31T00:00:00
modified: 2025-10-31T13:45:47
broader: (kunst etter funksjon, kontekst, opphav)
definition: Jødisk kunst er visuell kunst og artefakter som er skapt av kunstnere og håndverkere som har forankring i jødedom og jødisk kultur. <SNL>
editorial note: Lukket bemerkning: nasjonalmuseet25
editorial note: Var tidligere generell se-henvisning (31.10.25 / vsl)
in scheme: Humord
mapping relation: e23
preferred label: Jewish art @en

Innholdsbeskrivende emne
type: Class
label: Topic @en