Humord
type: ConceptScheme

(Asia i områder/regioner)
type: ThesaurusArray
type: Collection
narrower: Dardistan
preferred label: (Asia i område/regionar) @nn
preferred label: (Asia by areas/regions) @en

Geografisk
type: Class
label: Geographic @en

Dardistan
type: Geografisk
type: Concept
ccmapper candidates: 10
ccmapper state: accepted
created: 2017-02-13T00:00:00
modified: 2024-10-07T13:02:10
broad match: e23
broader: (Asia i områder/regioner)
definition: Dardistan er et område som dekker nordlige deler av Pakistan, Kashmir og nordøstlige deler av Afghanistan <UBO>
in scheme: Humord
mapping relation: e23