Geographic
type: Class
label: Geografisk @nb

Mogulriket
type: Geographic
type: Concept
ccmapper candidates: 11
ccmapper state: accepted
created: 2017-02-14T00:00:00
modified: 2025-02-24T14:53:20
alternative label: Mughal-dynastiet
alternative label: Moghulske rike
alternative label: Mughalriket
alternative label: Mogulske rike
broad match: e23
broader: (Asia i område/regionar)
definition: Mogulriket var et islamsk og tyrkisk rike som strakte seg over store deler av Det indiske subkontinent fra 1526 til 1857 <Wikipedia> @nb
in scheme: Humord
mapping relation: e23
preferred label: Mughal Empire @en

(Asia i område/regionar)
type: ThesaurusArray
type: Collection
narrower: Mogulriket
preferred label: (Asia i områder/regioner) @nb
preferred label: (Asia by areas/regions) @en

Humord
type: ConceptScheme