Humord
type: ConceptScheme

(Europa i områder/regioner)
type: ThesaurusArray
type: Collection
narrower: Nederlandene
preferred label: (Europa i område/regionar) @nn
preferred label: (Europe by areas/regions) @en

Geografisk
type: Class
label: Geographic @en

Nederlandene
type: Geografisk
type: Concept
ccmapper candidates: 22
ccmapper state: accepted
created: 1994-03-21T00:00:00
modified: 2025-04-06T22:30:28
alternative label: Low Lands @en
broader: (Europa i områder/regioner)
definition: Nederlandene betegner det nåværende Nederland, Belgia og deler av NordvestFrankrike til opprettelsen av en egen belgisk stat i 1831 <SNL>
in scheme: Humord
mapping relation: e23
preferred label: Nederlanda @nn
preferred label: Low Countries @en