Innholdsbeskrivende emne
type: Class
label: Topic @en

Humord
type: ConceptScheme

Peloponnesian War
type: Concept
type: Innholdsbeskrivende emne
ccmapper candidates: 11
ccmapper state: accepted
created: 1994-03-21T00:00:00
modified: 2025-07-15T16:43:45
alternative label: Den Peloponnesiske krig
alternative label: The Peloponnesian War @en
alternative label: Peloponneserkrigen
broader: (historie etter kriger)
definition: Peloponneskrigen var en krig som foregikk i perioden 431–404 fvt. mellom Athen og det athenske (deliske) sjøforbund på den ene siden og Sparta og det peloponnesiske forbund på den andre. <SNL>
in scheme: Humord
mapping relation: e23
preferred label: Peloponnesiske krig

(historie etter kriger)
type: ThesaurusArray
type: Collection
narrower: Peloponnesian War
preferred label: (historie etter krigar) @nn
preferred label: (history by wars) @en