Innholdsbeskrivende emne
type: Class
label: Topic @en

Humord
type: ConceptScheme

Seven Years' War
type: Innholdsbeskrivende emne
type: Concept
ccmapper candidates: 10
ccmapper state: accepted
created: 2005-01-14T00:00:00
modified: 2024-12-13T07:24:09
alternative label: Prøyssiske sjuårskrig (1756-1763)
alternative label: Sjuårskrigen @nn
alternative label: Syvårskrigen
alternative label: Tredje schlesiske krig
broad match: e23
broader: (historie etter kriger)
definition: Krig som 1756-1763 ble ført mellom Preussen og Storbritannia-Hannover på den ene siden og Østerrike, Det tyske rike, Frankrike og Sverige på den andre<SNL>
in scheme: Humord
mapping relation: e23
preferred label: Sjuårskrigen (1756-1763)
related match: e23

(historie etter kriger)
type: ThesaurusArray
type: Collection
narrower: Seven Years' War
preferred label: (historie etter krigar) @nn
preferred label: (history by wars) @en