(kunst etter retning, stil, synsvinkel)
type: ThesaurusArray
type: Collection
narrower: Fluxus
preferred label: (art by direction, style, angle) @en

Knuteterm
type: Class
label: Linking term @en

Fluxus
type: Knuteterm
type: Concept
ccmapper candidates: 9
ccmapper state: accepted
created: 1994-03-21T00:00:00
modified: 2025-04-11T14:58:03
broad match: e23
broader: (kunst etter retning, stil, synsvinkel)
definition: Fluxus var en eksperimenterende kunstretning, dannet i 1962 av George Maciunas (1931–1978). Retningen hadde røtter i dadaismen og lignende anti-kunstretninger, i konstruktivistiske manifester fra Russland, i Bauhaus og Marcel Duchamp <SNL>
in scheme: Humord
mapping relation: e23

Humord
type: ConceptScheme