Innholdsbeskrivende emne
type: Class
label: Topic @en

Sterke verb
type: Concept
type: Innholdsbeskrivende emne
ccmapper candidates: 11
ccmapper state: accepted
created: 2009-10-22T00:00:00
modified: 2025-07-23T07:20:50
broad match: e23
broader: (verb etter type)
definition: Eit norsk verb blir rekna som sterkt dersom preteritumsforma ikkje har eit suffiks som inneheld ein vokal. <SNL>
in scheme: Humord
mapping relation: e23
preferred label: Strong verbs @en

(verb etter type)
type: ThesaurusArray
type: Collection
narrower: Sterke verb
preferred label: (verb by type) @en

Humord
type: ConceptScheme