Innholdsbeskrivende emne
type: Class
label: Topic @en

Humord
type: ConceptScheme

Muwashah
type: Concept
type: Innholdsbeskrivende emne
ccmapper candidates: 1
ccmapper state: accepted
created: 1994-03-21T00:00:00
modified: 2025-09-01T10:42:11
alternative label: Muwashshah
alternative label: Moaxaja
broad match: e23
broader: (lyrikk etter type)
definition: En lyrisk sjanger skrevet på arabisk eller hebraisk, utviklet i det mauriske Spania på 1000- og 1100-tallet og utbredt senere i den muslimske verden <UBO> @nb
in scheme: Humord
mapping relation: e23
preferred label: Muwashshaḥ @en

(lyrikk etter type)
type: ThesaurusArray
type: Collection
narrower: Muwashah
preferred label: (poetry by type) @en