(kunst etter retning, stil, synsvinkel)
type: ThesaurusArray
type: Collection
narrower: Høyrenessansen
preferred label: (art by direction, style, angle) @en

Høyrenessansen
type: Concept
type: Innholdsbeskrivende emne
ccmapper candidates: 11
ccmapper state: accepted
created: 1994-03-21T00:00:00
modified: 2025-05-30T11:27:43
alternative label: Høgrenessanse @nn
alternative label: Høyrenessanse
broad match: e23
broader: (kunst etter retning, stil, synsvinkel)
definition: Høyrenessanse: sentral epoke i europeisk historie, med ny interesse for antikkens kultur, filosofi nog kunst, tidfestes til cirka 1490–1520 <SNL>
in scheme: Humord
mapping relation: e23
preferred label: Høgrenessansen @nn
preferred label: High renaissance @en
related match: e23

Innholdsbeskrivende emne
type: Class
label: Topic @en

Humord
type: ConceptScheme