Innholdsbeskrivende emne
type: Class
label: Topic @en

Humord
type: ConceptScheme

Qigong
type: Innholdsbeskrivende emne
type: Concept
ccmapper candidates: 1
ccmapper state: accepted
created: 2004-05-10T00:00:00
modified: 2024-12-09T11:16:52
alternative label: Qi gong
broader: (sport etter type)
definition: Kroppsøvelse innen kinesisk medisin hvor bl.a. pusteteknikk er viktig. Enkelte former for qigong brukes også innen sport/sirkus <UBO>
in scheme: Humord
mapping relation: e23

(sport etter type)
type: ThesaurusArray
type: Collection
narrower: Qigong
preferred label: (sports by type) @en