Innholdsbeskrivende emne
type: Class
label: Topic @en

Brosjyrer
type: Innholdsbeskrivende emne
type: Concept
ccmapper candidates: 10
ccmapper state: accepted
created: 2009-10-22T00:00:00
modified: 2025-01-30T14:41:43
alternative label: Småtrykk
alternative label: Leaflets @en
alternative label: Foldere
alternative label: Småskrift @nn
alternative label: Småskrifter
alternative label: Foldarar @nn
alternative label: Booklets @en
broad match: e23
broader: (dokumenter etter type)
definition: En brosjyre eller en folder er en trykksak i grenselandet mellom avis, blad og bok, og som tjener en påvirkningshensikt for avsender eller produsent. <SNL>
in scheme: Humord
mapping relation: e23
preferred label: Brosjyrar @nn
preferred label: Brochures @en
related match: e23

(dokumenter etter type)
type: ThesaurusArray
type: Collection
narrower: Brosjyrer
preferred label: (dokument etter type) @nn
preferred label: (document by type) @en

Humord
type: ConceptScheme