Segmental phonology
type: Concept
type: Innholdsbeskrivende emne
ccmapper candidates: 1
ccmapper state: accepted
created: 1996-02-29T00:00:00
modified: 2025-07-24T08:00:30
broad match: e23
broader: (fonologi etter type)
definition: Segmental fonologi er den delen av fonologien som beskriver de lydlige segmentene (foner, allofoner, fonemer) <UBO>
in scheme: Humord
mapping relation: e23
preferred label: Segmental fonologi

Innholdsbeskrivende emne
type: Class
label: Topic @en

(fonologi etter type)
type: ThesaurusArray
type: Collection
narrower: Segmental phonology
preferred label: (phonology by type) @en

Humord
type: ConceptScheme