Innholdsbeskrivende emne
type: Class
label: Topic @en

Kapeller
type: Innholdsbeskrivende emne
type: Concept
ccmapper candidates: 10
ccmapper state: accepted
created: 2009-10-22T00:00:00
modified: 2024-10-11T09:35:41
preferred label: Kapell @nn
broad match: e23
broader: (kirker i deler)
definition: Kapell er et begrep som kan brukes om en frittstående mindre kirke, men også om et mindre rom med eget alter som siderom eller utbygg til en kirke eller som et rom i et profant bygg <UBTØ>
in scheme: Humord
mapping relation: e23
preferred label: Chapels @en

(kirker i deler)
type: ThesaurusArray
type: Collection
narrower: Kapeller
preferred label: (kyrkjer i delar) @nn
preferred label: (churches in parts) @en

Humord
type: ConceptScheme