(Asia i land)
type: ThesaurusArray
type: Collection
narrower: Moab
preferred label: (Asia by countries) @en

Moab
type: Concept
type: Geografisk
ccmapper candidates: 1
ccmapper state: accepted
created: 2005-03-30T00:00:00
modified: 2025-02-19T16:36:32
broader: (Asia i land)
definition: Land i fjellområdet øst for Dødehavet. Møtte sin undergang ved babylonernes erobring ca. 600 f.Kr. <SNL>
editorial note: Lukket bemerkning: ubo05
in scheme: Humord
mapping relation: e23

Geografisk
type: Class
label: Geographic @en

Humord
type: ConceptScheme