Innholdsbeskrivende emne
type: Class
label: Topic @en

Humord
type: ConceptScheme

Kwangjuopprøret
type: Concept
type: Innholdsbeskrivende emne
ccmapper candidates: 7
ccmapper state: accepted
created: 2017-03-07T00:00:00
modified: 2024-12-17T07:51:43
alternative label: Kwangjumassakren
broad match: e23
broader: (historie etter opprør)
definition: Folkeopprør i Kwangju, Sør-Korea i mai 1980 forårsaket av utvidet unntakstilstand og arrestasjonen av Kim Dae Jung <SNL>
editorial note: Lukket bemerkning: ubo06
in scheme: Humord
mapping relation: e23
preferred label: Kwangju Uprising @en

(historie etter opprør)
type: ThesaurusArray
type: Collection
narrower: Kwangjuopprøret
preferred label: (history by revolts) @en