(Asia i land)
type: ThesaurusArray
type: Collection
narrower: Brunei
preferred label: (Asia by countries) @en

Geografisk
type: Class
label: Geographic @en

Brunei
type: Geografisk
type: Concept
ccmapper candidates: 1
ccmapper state: accepted
created: 2010-05-26T00:00:00
modified: 2025-02-19T16:29:12
broader: (Asia i land)
definition: Brunei er et lite land i Sørøst-Asia som er et sultanat. Det ligger på nordvestkysten av øya Borneo. <SNL>
editorial note: Lukket bemerkning: ubo10
in scheme: Humord
mapping relation: e23

Humord
type: ConceptScheme