Innholdsbeskrivende emne
type: Class
label: Topic @en

Verkstedspedagogikk
type: Concept
type: Innholdsbeskrivende emne
ccmapper candidates: 11
ccmapper state: accepted
created: 2017-03-31T00:00:00
modified: 2025-03-14T12:32:20
broad match: e23
broader: (pedagogikk etter type)
definition: Pedagogisk metode der deltakerne aktivt bygger noe, gjerne sammen, et produkt eller produkter av ulikt materiale. Begrepet knyttes ofte til (prosessorientert) skriving/skriveopplæring og læreplaner for grunnskolen <UBO>
editorial note: Lukket bemerkning: ubo11
in scheme: Humord
mapping relation: e23
preferred label: Theme-based, interdisciplinary workshop approach @en
preferred label: Verkstadspedagogikk @nn
related match: e23

(pedagogikk etter type)
type: ThesaurusArray
type: Collection
narrower: Verkstedspedagogikk
preferred label: (pedagogy by type) @en

Humord
type: ConceptScheme