Humord
type: ConceptScheme

New Spain
type: Concept
type: Geografisk
ccmapper candidates: 29
ccmapper state: accepted
created: 2017-01-09T00:00:00
modified: 2025-02-13T06:53:58
alternative label: Nueva España
broad match: e23
broader: (Amerika i land)
definition: Ny-Spania var Spanias koloni i Nord- og Mellom-Amerika fra 1500-tallet til 1800-tallet <A Dictionary of World History. Oxford University Press, 2000>
editorial note: Lukket bemerkning: ubtø11
in scheme: Humord
mapping relation: e23
preferred label: Ny-Spania

Geografisk
type: Class
label: Geographic @en

(Amerika i land)
type: ThesaurusArray
type: Collection
narrower: New Spain
preferred label: (America by countries) @en