Humord
type: ConceptScheme

Kultfilmer
type: Concept
type: Innholdsbeskrivende emne
ccmapper candidates: 10
ccmapper state: accepted
created: 2013-04-18T00:00:00
modified: 2025-12-09T15:03:00
alternative label: Cult cinema @en
alternative label: Cult classics @en
broad match: e23
broader: (film etter type)
definition: Film som er gjenstand for stor interesse og dyrkelse av en bestemt krets av personer på grunnlag av dens særlige kvaliteter, medvirkende, instruktører eller lignende <Wikipedia>
editorial note: Lukket bemerkning: ubo13
in scheme: Humord
mapping relation: e23
preferred label: Kultfilmar @nn
preferred label: Cult films @en

Innholdsbeskrivende emne
type: Class
label: Topic @en

(film etter type)
type: ThesaurusArray
type: Collection
narrower: Kultfilmer
preferred label: (movies by type) @en