(historie etter regimer)
type: ThesaurusArray
type: Collection
narrower: Kimdynastiet
preferred label: (historie etter regime) @nn
preferred label: (history by regimes) @en

Innholdsbeskrivende emne
type: Class
label: Topic @en

Kimdynastiet
type: Innholdsbeskrivende emne
type: Concept
ccmapper candidates: 1
ccmapper state: accepted
created: 2015-05-06T00:00:00
modified: 2024-12-16T10:56:29
alternative label: Kim-dynastiet
alternative label: Mount Peaktu Bloodline @en
alternative label: Mount Baekdu bloodline @en
broad match: e23
broader: (historie etter regimer)
definition: Periode i Nord-Korea hvor landet styres av de 3 generasjoner Kim: Kim Il- Sung (ledeperiode 1948-1994), Kim Jong-Il (ledeperiode 1994-2011), og Kim Jong-un (ledeperiode 2011-) <UBO>
editorial note: Lukket bemerkning: ubo15
in scheme: Humord
mapping relation: e23
preferred label: Kim dynasty @en

Humord
type: ConceptScheme