Innholdsbeskrivende emne
type: Class
label: Topic @en

Kings Bay-saken
type: Concept
type: Innholdsbeskrivende emne
ccmapper candidates: 3
ccmapper state: accepted
created: 2015-08-12T00:00:00
modified: 2024-12-16T11:02:35
broad match: e23
broader: (historie etter politiske hendelser)
definition: Kings Bay-saken, politisk strid i Norge i 1963. Saken førte til at den sittende regjeringen fra Arbeiderpartiet måtte gå av <SNL>
editorial note: Lukket bemerkning: ubo15
in scheme: Humord
mapping relation: e23
preferred label: Kings Bay Affair @en
preferred label: Kings Bay-saka @nn

(historie etter politiske hendelser)
type: ThesaurusArray
type: Collection
narrower: Kings Bay-saken
preferred label: (historie etter politiske hendingar @nn
preferred label: (history by political events) @en

Humord
type: ConceptScheme