Innholdsbeskrivende emne
type: Class
label: Topic @en

(personer etter sosiale, økonomiske og fysiske særtrekk eller egenskaper)
type: ThesaurusArray
type: Collection
narrower: Tyskerjenter
preferred label: (personar etter sosiale, økonomiske og fysiske særtrekk eller eigenskapar) @nn
preferred label: (persons by social, economical or physical features or characteristics) @en

Tyskerjenter
type: Concept
type: Innholdsbeskrivende emne
ccmapper candidates: 11
ccmapper state: accepted
created: 2017-05-02T00:00:00
modified: 2024-11-04T12:23:19
alternative label: Tyskertøser
broad match: e23
broader: (personer etter sosiale, økonomiske og fysiske særtrekk eller egenskaper)
definition: Nedsettende begrep som ble benyttet om de norske og danske kvinnene som hadde kjærlighetsforhold til tyske soldater i Norge og Danmark under andre verdenskrig <Wikipedia>
editorial note: Lukket bemerkning: ubo17
in scheme: Humord
mapping relation: e23

Humord
type: ConceptScheme