Innholdsbeskrivende emne
type: Class
label: Topic @en

Humord
type: ConceptScheme

(arkeologi etter type)
type: ThesaurusArray
type: Collection
narrower: Archaeology of religions
preferred label: (archaeology by type) @en

Archaeology of religions
type: Concept
type: Innholdsbeskrivende emne
ccmapper candidates: 12
ccmapper state: accepted
created: 2017-09-08T00:00:00
modified: 2024-11-22T07:40:57
alternative label: Archeology of religions @en
broad match: e23
broader: (arkeologi etter type)
definition: Arkeologiske studier av menneskers religiøse aktivitet, ofte ved bruk av religionsvitenskapelige og sosialantropologiske tolkingsmodeller <UBB>
editorial note: Lukket bemerkning: ubt17
in scheme: Humord
mapping relation: e23
preferred label: Religionsarkeologi
related match: e23