Innholdsbeskrivende emne
type: Class
label: Topic @en

Humord
type: ConceptScheme

Musha-opprøret
type: Concept
type: Innholdsbeskrivende emne
created: 2019-04-10T00:00:00
modified: 2024-08-30T12:45:35
alternative label: Wushe rebellion @en
alternative label: Musha uprising @en
alternative label: Wushe-opprøret
broader: (historie etter opprør)
definition: Musha-opprøret var et opprør mot japansk kolonistyre i den taiwanske byen Musha (Wushe), oktober til desember 1930 <UBO>
editorial note: Lukket bemerkning: ibi19
in scheme: Humord
preferred label: Musha rebellion @en

(historie etter opprør)
type: ThesaurusArray
type: Collection
narrower: Musha-opprøret
preferred label: (history by revolts) @en