(kunst etter retning, stil, synsvinkel)
type: ThesaurusArray
type: Collection
narrower: Arts and crafts movement
preferred label: (art by direction, style, angle) @en

Innholdsbeskrivende emne
type: Class
label: Topic @en

Arts and crafts movement
type: Innholdsbeskrivende emne
type: Concept
created: 2022-01-25T00:00:00
modified: 2025-04-04T14:36:31
broader: (kunst etter retning, stil, synsvinkel)
definition: Arts and Crafts Movement var det engelske navnet på en designretning eller bevegelse som ville gjenreise de estetiske kvalitetene i kunsthåndverket. Bevegelsen oppstod på 1860-tallet og varte til begynnelsen av 1900-tallet med et høydepunkt i Storbritannia og USA mellom 1880 og 1910. <wikipedia>
editorial note: Lukket bemerkning: Nasjonalmuseet22
in scheme: Humord

Humord
type: ConceptScheme