Innholdsbeskrivende emne
type: Class
label: Topic @en

(båter etter type)
type: ThesaurusArray
type: Collection
narrower: Fritidsbåter
preferred label: (båtar etter type) @nn
preferred label: (boats by type) @en

Fritidsbåter
type: Concept
type: Innholdsbeskrivende emne
created: 2023-02-01T00:00:00
modified: 2025-01-06T06:54:16
alternative label: Pleasure boats @en
broader: (båter etter type)
definition: Begrepet fritidsbåt omfatter mindre båter som brukes på fritiden og omfatter ikke båter til yrkesbruk <SNL>
editorial note: Lukket bemerkning: ubo23
in scheme: Humord
preferred label: Leisure boats @en
preferred label: Fritidsbåtar @nn

Humord
type: ConceptScheme