Innholdsbeskrivende emne
type: Class
label: Topic @en

(båter etter type)
type: ThesaurusArray
type: Collection
narrower: Nuclear ship
preferred label: (båtar etter type) @nn
preferred label: (boats by type) @en

Nuclear ship
type: Concept
type: Innholdsbeskrivende emne
created: 2023-03-21T00:00:00
modified: 2024-08-28T13:20:46
alternative label: Nuclear powered ships @en
alternative label: Atomdrivne skip @nn
alternative label: Atomdrevne skip
broader: (båter etter type)
definition: Atomskip er en betegnelse på fartøy med energiforsyning fra atomspalting, det vil si at de får energien til fremdriften fra en kjernefysisk reaktor om bord <SNL>
editorial note: Lukket bemerkning: ubo23
in scheme: Humord
preferred label: Atomskip

Humord
type: ConceptScheme