Innholdsbeskrivende emne
type: Class
label: Topic @en

Kommisjonærer
type: Concept
type: Innholdsbeskrivende emne
created: 2023-06-12T00:00:00
modified: 2025-09-09T09:53:42
broader: (personer etter yrke)
definition: En kommisjonær er en person eller virksomhet som har fullmakt til å utføre noe (f.eks. selge, kjøpe) på andres vegne ; person, firma som handler i kommisjon <naob.no>
editorial note: Lukket bemerkning: ubo23
in scheme: Humord
preferred label: Commission agents @en
preferred label: Kommisjonærar @nn

(personer etter yrke)
type: ThesaurusArray
type: Collection
narrower: Kommisjonærer
preferred label: (personar etter yrke) @nn
preferred label: (persons by profession) @en

Humord
type: ConceptScheme