(fjell i Norge)
type: ThesaurusArray
type: Collection
narrower: Børgefjell
preferred label: (fjell i Noreg) @nn
preferred label: (mountains in Norway) @en

Geografisk
type: Class
label: Geographic @en

Børgefjell
type: Geografisk
type: Concept
created: 2023-11-17T00:00:00
modified: 2025-03-24T08:26:11
broader: (fjell i Norge)
definition: Børgefjell er et fjellparti på grensen mellom Grane og Hattfjelldal kommuner i Nordland fylke, og Røyrvik og Namsskogan kommuner i Trøndelag fylke <SNL>
editorial note: Lukket bemerkning: ubo23
in scheme: Humord

Humord
type: ConceptScheme