Dance sports
type: Concept
type: Innholdsbeskrivende emne
created: 2024-02-08T00:00:00
modified: 2024-02-11T09:59:09
alternative label: Selskapsdans
alternative label: Sportsdansar @nn
alternative label: Sportsdanser
broader: (dans etter type)
broader: (sport etter type)
definition: Sportsdans er dans drevet som konkurranseidrett. Man konkurrerer tradisjonelt i ti danser delt i grenene standarddanser og latinamerikanske danser. <SNL>
editorial note: Lukket bemerkning: ubo24
editorial note: Lukket bemerkning: NIH
in scheme: Humord
preferred label: Sportsdans

Innholdsbeskrivende emne
type: Class
label: Topic @en

(dans etter type)
type: ThesaurusArray
type: Collection
narrower: Dance sports
preferred label: (dance by type) @en

(sport etter type)
type: ThesaurusArray
type: Collection
narrower: Dance sports
preferred label: (sports by type) @en

Humord
type: ConceptScheme