Innholdsbeskrivende emne
type: Class
label: Topic @en

Triatlon
type: Innholdsbeskrivende emne
type: Concept
ccmapper candidates: 1
ccmapper state: accepted
created: 2024-02-08T00:00:00
modified: 2024-02-08T15:07:44
preferred label: Triathlon
broader: (sport etter type)
definition: Triatlon er utholdenhetsidrett hvor bestemte distanser i svømming, sykling og løp gjennomføres uten pause mellom øvelsene og med kontinuerlig tidtaking. <SNL>
editorial note: Lukket bemerkning: NIH
editorial note: Lukket bemerkning: ubo24
in scheme: Humord
mapping relation: e23

(sport etter type)
type: ThesaurusArray
type: Collection
narrower: Triatlon
preferred label: (sports by type) @en

Humord
type: ConceptScheme