Innholdsbeskrivende emne
type: Class
label: Topic @en

Darts
type: Concept
type: Innholdsbeskrivende emne
ccmapper candidates: 1
ccmapper state: accepted
created: 2024-02-19T00:00:00
modified: 2024-02-19T11:27:28
alternative label: Dart
broader: (sport etter type)
definition: Darts er et innendørs presisjonsspill hvor man kaster piler mot en sirkelrund målskive delt i sektorer og ringer med forskjellig poengverdi. Kasteavstanden er 2,37 meter. <SNL>
editorial note: Lukket bemerkning: ubo24
editorial note: Lukket bemerkning: NIH
in scheme: Humord
mapping relation: e23

(sport etter type)
type: ThesaurusArray
type: Collection
narrower: Darts
preferred label: (sports by type) @en

Humord
type: ConceptScheme