Humord
type: ConceptScheme

Makroøkologi
type: Concept
type: Innholdsbeskrivende emne
created: 2024-10-14T00:00:00
modified: 2025-04-03T15:02:19
broader: (økologi etter type)
definition: Makroøkologi er et felt innenfor økologi som omhandler forholdet mellom forskjellige arter på en stor skala, som prøver å karakterisere og forklare statistiske mønstre i mengde, distribusjon og mangfold av arter. <Wikipedia>
editorial note: Lukket bemerkning: ubo24
in scheme: Humord
preferred label: Macroecology @en

Innholdsbeskrivende emne
type: Class
label: Topic @en

(økologi etter type)
type: ThesaurusArray
type: Collection
narrower: Makroøkologi
preferred label: (ecology by type) @en