Innholdsbeskrivende emne
type: Class
label: Topic @en

(planter etter type)
type: ThesaurusArray
type: Collection
narrower: Kjøttetende planter
preferred label: (plantar etter type) @nn
preferred label: (plants by type) @en

Kjøttetende planter
type: Innholdsbeskrivende emne
type: Concept
created: 2024-10-17T00:00:00
modified: 2025-08-15T12:47:52
alternative label: Kjøttetande planter @nn
alternative label: Kjøttetande plantar @nn
alternative label: Kjøtetande plantar @nn
broader: (planter etter type)
definition: Kjøttetende planter er planter som ved siden av at de assimilerer karbondioksid, kan skaffe seg næring ved opptak av dyrisk føde. <SNL>
editorial note: Lukket bemerkning: ubo24
in scheme: Humord
preferred label: Kjøtetande planter @nn
preferred label: Carnivorous plants @en

Humord
type: ConceptScheme