Humord
type: ConceptScheme

Arbeiderfilm
type: Concept
type: Innholdsbeskrivende emne
created: 2024-11-07T00:00:00
modified: 2024-11-07T09:05:30
alternative label: Workers' film @en
broader: (film etter type)
definition: Arbeiderfilm er en betegnelse på et knippe norske filmer fra 1930-tallet som ble støttet av arbeiderbevegelsen. <wikipedia>
editorial note: Lukket bemerkning: ubo24
editorial note: Lukket bemerkning: arbark
in scheme: Humord
preferred label: Labor fillm @en
preferred label: Arbeidarfilm @nn

Innholdsbeskrivende emne
type: Class
label: Topic @en

(film etter type)
type: ThesaurusArray
type: Collection
narrower: Arbeiderfilm
preferred label: (movies by type) @en