Innholdsbeskrivende emne
type: Class
label: Topic @en

Beregningskjemi
type: Concept
type: Innholdsbeskrivende emne
created: 2024-12-23T00:00:00
modified: 2024-12-23T15:20:38
broader: (kjemi etter type)
definition: Beregningskjemi er et område innen kjemien der kjemiske reaksjoner og prosesser blir modellert og simulert i datamaskiner i stedet for at de gjennomføres i et laboratorium. <SNL>
editorial note: Lukket bemerkning: ubo24
in scheme: Humord
preferred label: Computational chemistry @en
preferred label: Berekningskjemi @nn

(kjemi etter type)
type: ThesaurusArray
type: Collection
narrower: Beregningskjemi
preferred label: (chemistry by type) @en

Humord
type: ConceptScheme