Innholdsbeskrivende emne
type: Class
label: Topic @en

Sulitjelma-affair
type: Innholdsbeskrivende emne
type: Concept
created: 2025-09-25T00:00:00
modified: 2025-09-25T09:39:38
alternative label: Sulitjelma matter @en
alternative label: Sulitjelmaaffæren
broader: (historie etter politiske hendelser)
definition: Sulitjelma-affæren er ettertidens betegnelse på en konflikt mellom arbeidere og politi i gruvesamfunnet Sulitjelma i 1918. <wikipedia>
editorial note: Lukket bemerkning: ubo25
in scheme: Humord
preferred label: Sulitjelma-affæren

(historie etter politiske hendelser)
type: ThesaurusArray
type: Collection
narrower: Sulitjelma-affair
preferred label: (historie etter politiske hendingar @nn
preferred label: (history by political events) @en

Humord
type: ConceptScheme