Innholdsbeskrivende emne
type: Class
label: Topic @en

Humord
type: ConceptScheme

Petrochemistry
type: Innholdsbeskrivende emne
type: Concept
created: 2026-02-10T00:00:00
modified: 2026-02-10T14:59:03
broader: (kjemi etter type)
definition: Petrokjemi er et fagområde innen kjemisk industri der kjemiske produkter fremstilles av råolje og naturgass (petroleum). <SNL>
editorial note: Lukket bemerkning: ubo26
in scheme: Humord
preferred label: Petrokjemi

(kjemi etter type)
type: ThesaurusArray
type: Collection
narrower: Petrochemistry
preferred label: (chemistry by type) @en