Bengal
type: Geografisk
type: Concept
ccmapper candidates: 10
ccmapper state: accepted
created: 2005-10-05T00:00:00
modified: 2024-10-17T14:49:12
broader: (Asia i områder/regioner)
definition: Bengal er et landområde i den nordøstlige delen av det indiske subkontinent, tidligere en provins i Britisk India, i dag delt mellom den indiske delstaten West Bengal og Bangladesh. <SNL>
in scheme: Humord
mapping relation: e23

Humord
type: ConceptScheme

(Asia i områder/regioner)
type: ThesaurusArray
type: Collection
narrower: Bengal
preferred label: (Asia i område/regionar) @nn
preferred label: (Asia by areas/regions) @en

Geografisk
type: Class
label: Geographic @en