Innholdsbeskrivende emne
type: Class
label: Topic @en

Humord
type: ConceptScheme

Russiske revolusjon (1917)
type: Concept
type: Innholdsbeskrivende emne
ccmapper candidates: 1
ccmapper state: accepted
created: 1999-01-15T00:00:00
modified: 2024-09-24T12:43:51
alternative label: Den Russiske revolusjon (1917)
alternative label: Oktoberrevolusjonen
alternative label: Bolsjevikrevolusjonen
alternative label: Russian Revolution (1917) @en
broad match: e23
broader: (historie etter revolusjoner)
definition: Den russiske revolusjon var en revolusjon i 1917, som først avskaffet det russiske keiserriket og deretter brakte bolsjevikpartiet (det senere kommunistpartiet) til makten i Russland. <SNL> @nb
in scheme: Humord
mapping relation: e23
preferred label: Russian Revolution @en

(historie etter revolusjoner)
type: ThesaurusArray
type: Collection
narrower: Russiske revolusjon (1917)
preferred label: (history by revolutions) @en