Innholdsbeskrivende emne
type: Class
label: Topic @en

Humord
type: ConceptScheme

(dans etter type)
type: ThesaurusArray
type: Collection
narrower: Ankoku buto
preferred label: (dance by type) @en

Ankoku buto
type: Concept
type: Innholdsbeskrivende emne
ccmapper candidates: 10
ccmapper state: accepted
created: 1996-03-06T00:00:00
modified: 2024-08-15T08:48:18
alternative label: Butoh
broad match: e23
broader: (dans etter type)
definition: Ankoku buto er en japansk dans utviklet fra tradisjonelt japansk danseteater og vestlig dans og teater <UBO>
in scheme: Humord
mapping relation: e23