(kunst etter retning, stil, synsvinkel)
type: ThesaurusArray
type: Collection
narrower: Funksjonalismen (Kunst)
preferred label: (art by direction, style, angle) @en

Humord
type: ConceptScheme

Funksjonalismen (Kunst)
type: Concept
type: Innholdsbeskrivende emne
ccmapper candidates: 13
ccmapper state: accepted
created: 1994-03-21T00:00:00
modified: 2025-06-02T07:53:57
alternative label: Funkis
alternative label: Funksjonalisme
broad match: e23
broader: (kunst etter retning, stil, synsvinkel)
definition: Funksjonalisme er en stilart i bygg, møbler og lignende som legger vekt på praktisk nytte og enkel form, og som kjennetegnes ved rene, enkle linjer og flater (SNL)
in scheme: Humord
mapping relation: e23
preferred label: Functionalism @en
related match: e23

Innholdsbeskrivende emne
type: Class
label: Topic @en