(kunst etter retning, stil, synsvinkel)
type: ThesaurusArray
type: Collection
narrower: Kubismen
preferred label: (art by direction, style, angle) @en

Humord
type: ConceptScheme

Kubismen
type: Concept
type: Innholdsbeskrivende emne
ccmapper candidates: 9
ccmapper state: accepted
created: 1994-03-21T00:00:00
modified: 2025-05-30T11:29:45
alternative label: Kubisme
alternative label: Cubisme
broader: (kunst etter retning, stil, synsvinkel)
definition: Kubisme er en retning i målarkunst og skulptur etter 1900 som arbeider med å løyse opp formene i naturen i enkle, abstrakte geometriske og stereometriske grunnformer <ordbøkene.no>
in scheme: Humord
mapping relation: e23
preferred label: Cubism @en
related match: e23

Innholdsbeskrivende emne
type: Class
label: Topic @en