(art by direction, style, angle)
type: ThesaurusArray
type: Collection
narrower: Ringerike style
preferred label: (kunst etter retning, stil, synsvinkel) @nn

Humord
type: ConceptScheme

Ringerike style
type: Topic
type: Concept
ccmapper candidates: 8
ccmapper state: accepted
created: 1994-03-21T00:00:00
modified: 2025-04-11T11:48:19
broad match: e23
broader: (art by direction, style, angle)
definition: Ringeriksstil er en ornamental stilart i Norden i slutten av vikingtiden (rundt 1000–1050). Den er en videreutvikling av vikingtidens foregående stilfase, jellingstilen. Ringeriksstilen er blant annet bevart på noen få billedsteiner av rødaktig sandstein, som man mener er tatt på Ringerike. <SNL> @nb
in scheme: Humord
mapping relation: e23
preferred label: Ringeriksstil @nn
related match: e23

Topic
type: Class
label: Innholdsbeskrivende emne @nb