(kunst etter retning, stil, synsvinkel)
type: ThesaurusArray
type: Collection
narrower: Romanesque art
preferred label: (art by direction, style, angle) @en

Humord
type: ConceptScheme

Romanesque art
type: Concept
type: Innholdsbeskrivende emne
ccmapper candidates: 11
ccmapper state: accepted
created: 1994-03-21T00:00:00
modified: 2025-04-25T09:42:37
alternative label: Rundbuestil
alternative label: Rundbogestil @nn
broader: (kunst etter retning, stil, synsvinkel)
definition: Romansk stil er en stilepoke i europeisk middelalder rundt 1000/1050–1150/1200. Det er den første felleseuropeiske stilen, selv om den ikke nådde en så vid utbredelse og ensartet form som gotikken (SNL)
in scheme: Humord
mapping relation: e23
preferred label: Romansk stil
related match: e23

Innholdsbeskrivende emne
type: Class
label: Topic @en