Inchoative verbs
type: Concept
type: Topic
ccmapper candidates: 10
ccmapper state: accepted
created: 2009-10-22T00:00:00
modified: 2025-07-22T14:46:40
alternative label: Inceptive verbs
broad match: e23
broader: (verb by type)
definition: Inkoaktive verb er verb som som uttrykker begynnelse eller begynnende tilstand <naob.no> @nb
in scheme: Humord
mapping relation: e23
preferred label: Inkoative verb @nn

Humord
type: ConceptScheme

(verb by type)
type: ThesaurusArray
type: Collection
narrower: Inchoative verbs
preferred label: (verb etter type) @nn

Topic
type: Class
label: Innholdsbeskrivende emne @nb