Humord
type: ConceptScheme

Geografisk
type: Class
label: Geographic @en

São Tomé og Principe
type: Concept
type: Geografisk
ccmapper candidates: 1
ccmapper state: accepted
created: 2011-05-06T00:00:00
modified: 2025-02-04T08:26:50
broader: (Afrika i land)
definition: São Tomé og Príncipe er en republikk i Vest-Afrika, i Guineabukta, om lag 275 kilometer fra kysten av Gabon like nord for ekvator. <SNL>
in scheme: Humord
mapping relation: e23
preferred label: São Tomé and Príncipe @en

(Afrika i land)
type: ThesaurusArray
type: Collection
narrower: São Tomé og Principe
preferred label: (Africa by countries) @en