Innholdsbeskrivende emne
type: Class
label: Topic @en

Humord
type: ConceptScheme

Stoaer
type: Concept
type: Innholdsbeskrivende emne
ccmapper candidates: 11
ccmapper state: accepted
created: 2009-10-22T00:00:00
modified: 2024-10-18T07:08:28
alternative label: Stoaes @en
broad match: e23
broader: (bygninger etter type)
definition: Stoa er en gresk bygningstype, fortrinnsvis knyttet til offentlige samlingssteder som torg, teatre, helligdommer og så videre. Kan være rektangulær eller hesteskoformet, i én eller to etasjer <SNL>
in scheme: Humord
mapping relation: e23
preferred label: Stoas @en
preferred label: Stoaar @nn

(bygninger etter type)
type: ThesaurusArray
type: Collection
narrower: Stoaer
preferred label: (bygningar etter type) @nn
preferred label: (buildings by type) @en